Build fails

• Oct 13, 2009 - 19:04

Just updated from svn, and the build fails at about 89%,

[ 89%] Building CXX object scriptgen/qtbindings/gui/CMakeFiles/qtscript_gui.dir/qtscriptshell_QDropEvent.cpp.o
[ 89%] Building CXX object scriptgen/qtbindings/gui/CMakeFiles/qtscript_gui.dir/qtscriptshell_QDrag.cpp.o
Linking CXX shared library libqtscript_gui.so
[ 89%] Built target qtscript_gui
make: *** [all] Error 2

Not sure what to make of this, but if it helps, i'm on Gentoo linux 64bit, and i wonder if 64bit is the problem here, as during the build i got a stack of Qscript warnings like these: (shortened to fit in a reasonable post length)

/home/alex/svn-projects/mscore/trunk/mscore/scriptgen/qtbindings/gui/qtscript_QStyle.cpp: In function 'QScriptValue qtscript_construct_QStyle_SubElement(QScriptContext*, QScriptEngine*)':
/home/alex/svn-projects/mscore/trunk/mscore/scriptgen/qtbindings/gui/qtscript_QStyle.cpp:1960: warning: comparison between signed and unsigned integer expressions
/home/alex/svn-projects/mscore/trunk/mscore/scriptgen/qtbindings/gui/qtscript_QStyleHintReturn.cpp:261: warning: 'QScriptValue qtscript_QStyleHintReturn_prototype_call(QScriptContext*, QScriptEngine*)' defined but not used
/home/alex/svn-projects/mscore/trunk/mscore/scriptgen/qtbindings/gui/qtscript_QStyleFactory.cpp:52: warning: 'QScriptValue qtscript_QStyleFactory_prototype_call(QScriptContext*, QScriptEngine*)' defined but not used

and these:

[ 71%] Building CXX object scriptgen/qtbindings/gui/CMakeFiles/qtscript_gui.dir/qtscriptshell_QAccessiblePlugin.cpp.o
/home/alex/svn-projects/mscore/trunk/mscore/scriptgen/qtbindings/gui/qtscriptshell_QAccessibleObject.cpp: In member function 'virtual QString QtScriptShell_QAccessibleObject::text(QAccessible::Text, int) const':
/home/alex/svn-projects/mscore/trunk/mscore/scriptgen/qtbindings/gui/qtscriptshell_QAccessibleObject.cpp:224: warning: control reaches end of non-void function
/home/alex/svn-projects/mscore/trunk/mscore/scriptgen/qtbindings/gui/qtscriptshell_QAccessibleObject.cpp: In member function 'virtual QFlags QtScriptShell_QAccessibleObject::state(int) const':
/home/alex/svn-projects/mscore/trunk/mscore/scriptgen/qtbindings/gui/qtscriptshell_QAccessibleObject.cpp:209: warning: control reaches end of non-void function
/home/alex/svn-projects/mscore/trunk/mscore/scriptgen/qtbindings/gui/qtscriptshell_QAccessibleObject.cpp: In member function 'virtual QAccessible::Role QtScriptShell_QAccessibleObject::role(int) const':
/home/alex/svn-projects/mscore/trunk/mscore/scriptgen/qtbindings/gui/qtscriptshell_QAccessibleObject.cpp:179: warning: control reaches end of non-void function
/home/alex/svn-projects/mscore/trunk/mscore/scriptgen/qtbindings/gui/qtscriptshell_QAccessibleObject.cpp: In member function 'virtual QFlags QtScriptShell_QAccessibleObject::relationTo(int, const QAccessibleInterface*, int) const':
/home/alex/svn-projects/mscore/trunk/mscore/scriptgen/qtbindings/gui/qtscriptshell_QAccessibleObject.cpp:165: warning: control reaches end of non-void function
/home/alex/svn-projects/mscore/trunk/mscore/scriptgen/qtbindings/gui/qtscriptshell_QAccessibleObject.cpp: In member function 'virtual int QtScriptShell_QAccessibleObject::navigate(QAccessible::RelationFlag, int, QAccessibleInterface**) const':
/home/alex/svn-projects/mscore/trunk/mscore/scriptgen/qtbindings/gui/qtscriptshell_QAccessibleObject.cpp:124: warning: control reaches end of non-void function
/home/alex/svn-projects/mscore/trunk/mscore/scriptgen/qtbindings/gui/qtscriptshell_QAccessibleObject.cpp: In member function 'virtual int QtScriptShell_QAccessibleObject::indexOfChild(const QAccessibleInterface*) const':
/home/alex/svn-projects/mscore/trunk/mscore/scriptgen/qtbindings/gui/qtscriptshell_QAccessibleObject.cpp:97: warning: control reaches end of non-void function
/home/alex/svn-projects/mscore/trunk/mscore/scriptgen/qtbindings/gui/qtscriptshell_QAccessibleObject.cpp: In member function 'virtual int QtScriptShell_QAccessibleObject::childCount() const':
/home/alex/svn-projects/mscore/trunk/mscore/scriptgen/qtbindings/gui/qtscriptshell_QAccessibleObject.cpp:67: warning: control reaches end of non-void function
/home/alex/svn-projects/mscore/trunk/mscore/scriptgen/qtbindings/gui/qtscriptshell_QAccessibleObject.cpp: In member function 'virtual int QtScriptShell_QAccessibleObject::childAt(int, int) const':
/home/alex/svn-projects/mscore/trunk/mscore/scriptgen/qtbindings/gui/qtscriptshell_QAccessibleObject.cpp:56: warning: control reaches end of non-void function
/home/alex/svn-projects/mscore/trunk/mscore/scriptgen/qtbindings/gui/qtscriptshell_QAccessibleInterfaceEx.cpp: In member function 'virtual int QtScriptShell_QAccessibleInterfaceEx::userActionCount(int) const':
/home/alex/svn-projects/mscore/trunk/mscore/scriptgen/qtbindings/gui/qtscriptshell_QAccessibleInterfaceEx.cpp:254: warning: control reaches end of non-void function
/home/alex/svn-projects/mscore/trunk/mscore/scriptgen/qtbindings/gui/qtscriptshell_QAccessibleInterfaceEx.cpp: In member function 'virtual QString QtScriptShell_QAccessibleInterfaceEx::text(QAccessible::Text, int) const':
/home/alex/svn-projects/mscore/trunk/mscore/scriptgen/qtbindings/gui/qtscriptshell_QAccessibleInterfaceEx.cpp:240: warning: control reaches end of non-void function
/home/alex/svn-projects/mscore/trunk/mscore/scriptgen/qtbindings/gui/qtscriptshell_QAccessibleInterfaceEx.cpp: In member function 'virtual QFlags QtScriptShell_QAccessibleInterfaceEx::state(int) const':
/home/alex/svn-projects/mscore/trunk/mscore/scriptgen/qtbindings/gui/qtscriptshell_QAccessibleInterfaceEx.cpp:225: warning: control reaches end of non-void function

Alex.


Comments

Sorry, didn't add the rev number.
alex@parchmentstudios ~/svn-projects/mscore/trunk/mscore $ svn update
At revision 2193.
(cmake version 2.6.4)

cmake .

QT lib found at /usr/lib64/qt4
Alsa detected
Jack detected
portaudio detected /usr/include /usr/lib -L/usr/lib -lportaudio -lm -ljack -lpthread -lrt -lasound
-- Configuring done
-- Generating done
-- Build files have been written to: /home/alex/svn-projects/mscore/trunk/mscore

Additional errors after a cleanout, and try again:

[ 8%] Building CXX object mscore/CMakeFiles/smf2xml.dir/event.cpp.o
In file included from /home/alex/svn-projects/mscore/trunk/mscore/mscore/score.h:33,
from /home/alex/svn-projects/mscore/trunk/mscore/mscore/event.cpp:24:
/home/alex/svn-projects/mscore/trunk/mscore/mscore/select.h:24:23: error: ui_select.h: No such file or directory
Linking CXX static library libfluid.a
[ 8%] Built target fluid
In file included from /home/alex/svn-projects/mscore/trunk/mscore/mscore/score.h:33,
from /home/alex/svn-projects/mscore/trunk/mscore/mscore/event.cpp:24:
/home/alex/svn-projects/mscore/trunk/mscore/mscore/select.h:107: error: 'Ui' has not been declared
/home/alex/svn-projects/mscore/trunk/mscore/mscore/select.h:107: error: expected `{' before 'SelectDialog'
/home/alex/svn-projects/mscore/trunk/mscore/mscore/select.h:107: error: function definition does not declare parameters
Scanning dependencies of target qtscript_core
make[2]: *** [mscore/CMakeFiles/smf2xml.dir/event.cpp.o] Error 1
make[1]: *** [mscore/CMakeFiles/smf2xml.dir/all] Error 2
make[1]: *** Waiting for unfinished jobs....
[ 8%] Building CXX object mscore/CMakeFiles/xml2smf.dir/midifile.cpp.o
[ 8%] Building CXX object mscore/CMakeFiles/xml2smf.dir/event.cpp.o
In file included from /home/alex/svn-projects/mscore/trunk/mscore/mscore/score.h:33,
from /home/alex/svn-projects/mscore/trunk/mscore/mscore/event.cpp:24:
/home/alex/svn-projects/mscore/trunk/mscore/mscore/select.h:24:23: error: ui_select.h: No such file or directory
[ 8%] Building CXX object scriptgen/qtbindings/core/CMakeFiles/qtscript_core.dir/main.cpp.o
In file included from /home/alex/svn-projects/mscore/trunk/mscore/mscore/score.h:33,
from /home/alex/svn-projects/mscore/trunk/mscore/mscore/event.cpp:24:
/home/alex/svn-projects/mscore/trunk/mscore/mscore/select.h:107: error: 'Ui' has not been declared
/home/alex/svn-projects/mscore/trunk/mscore/mscore/select.h:107: error: expected `{' before 'SelectDialog'
/home/alex/svn-projects/mscore/trunk/mscore/mscore/select.h:107: error: function definition does not declare parameters
make[2]: *** [mscore/CMakeFiles/xml2smf.dir/event.cpp.o] Error 1
make[2]: *** Waiting for unfinished jobs....
[ 9%] Building CXX object scriptgen/qtbindings/core/CMakeFiles/qtscript_core.dir/qtscript_QBasicTimer.cpp.o
[ 9%] Building CXX object scriptgen/qtbindings/core/CMakeFiles/qtscript_core.dir/qtscript_QBitArray.cpp.o
[ 9%] Building CXX object scriptgen/qtbindings/core/CMakeFiles/qtscript_core.dir/qtscript_QBuffer.cpp.o
make[1]: *** [mscore/CMakeFiles/xml2smf.dir/all] Error 2
[ 9%] Building CXX object scriptgen/qtbindings/core/CMakeFiles/qtscript_core.dir/qtscript_QByteArray.cpp.o
[ 9%] Building CXX object scriptgen/qtbindings/core/CMakeFiles/qtscript_core.dir/qtscript_QByteArrayMatcher.cpp.o
[ 9%] Building CXX object scriptgen/qtbindings/core/CMakeFiles/qtscript_core.dir/qtscript_QChildEvent.cpp.o
[ 9%] Building CXX object scriptgen/qtbindings/core/CMakeFiles/qtscript_core.dir/qtscript_QCoreApplication.cpp.o
[ 9%] Building CXX object scriptgen/qtbindings/core/CMakeFiles/qtscript_core.dir/qtscript_QCryptographicHash.cpp.o
[ 9%] Building CXX object scriptgen/qtbindings/core/CMakeFiles/qtscript_core.dir/qtscript_QDataStream.cpp.o

[ 17%] Building CXX object scriptgen/qtbindings/core/CMakeFiles/qtscript_core.dir/qtscriptshell_QAbstractItemModel.cpp.o
[ 17%] Building CXX object scriptgen/qtbindings/core/CMakeFiles/qtscript_core.dir/qtscriptshell_QAbstractListModel.cpp.o
[ 17%] Building CXX object scriptgen/qtbindings/core/CMakeFiles/qtscript_core.dir/qtscriptshell_QAbstractTableModel.cpp.o
/home/alex/svn-projects/mscore/trunk/mscore/scriptgen/qtbindings/core/qtscriptshell_QAbstractItemModel.cpp: In member function 'virtual int QtScriptShell_QAbstractItemModel::rowCount(const QModelIndex&) const':
/home/alex/svn-projects/mscore/trunk/mscore/scriptgen/qtbindings/core/qtscriptshell_QAbstractItemModel.cpp:412: warning: control reaches end of non-void function
/home/alex/svn-projects/mscore/trunk/mscore/scriptgen/qtbindings/core/qtscriptshell_QAbstractItemModel.cpp: In member function 'virtual QModelIndex QtScriptShell_QAbstractItemModel::parent(const QModelIndex&) const':
/home/alex/svn-projects/mscore/trunk/mscore/scriptgen/qtbindings/core/qtscriptshell_QAbstractItemModel.cpp:355: warning: control reaches end of non-void function
/home/alex/svn-projects/mscore/trunk/mscore/scriptgen/qtbindings/core/qtscriptshell_QAbstractItemModel.cpp: In member function 'virtual QModelIndex QtScriptShell_QAbstractItemModel::index(int, int, const QModelIndex&) const':
/home/alex/svn-projects/mscore/trunk/mscore/scriptgen/qtbindings/core/qtscriptshell_QAbstractItemModel.cpp:252: warning: control reaches end of non-void function
/home/alex/svn-projects/mscore/trunk/mscore/scriptgen/qtbindings/core/qtscriptshell_QAbstractItemModel.cpp: In member function 'virtual QVariant QtScriptShell_QAbstractItemModel::data(const QModelIndex&, int) const':
/home/alex/svn-projects/mscore/trunk/mscore/scriptgen/qtbindings/core/qtscriptshell_QAbstractItemModel.cpp:131: warning: control reaches end of non-void function
/home/alex/svn-projects/mscore/trunk/mscore/scriptgen/qtbindings/core/qtscriptshell_QAbstractItemModel.cpp: In member function 'virtual int QtScriptShell_QAbstractItemModel::columnCount(const QModelIndex&) const':
/home/alex/svn-projects/mscore/trunk/mscore/scriptgen/qtbindings/core/qtscriptshell_QAbstractItemModel.cpp:102: warning: control reaches end of non-void function
/home/alex/svn-projects/mscore/trunk/mscore/scriptgen/qtbindings/core/qtscriptshell_QAbstractListModel.cpp: In member function 'virtual int QtScriptShell_QAbstractListModel::rowCount(const QModelIndex&) const':
/home/alex/svn-projects/mscore/trunk/mscore/scriptgen/qtbindings/core/qtscriptshell_QAbstractListModel.cpp:372: warning: control reaches end of non-void function
/home/alex/svn-projects/mscore/trunk/mscore/scriptgen/qtbindings/core/qtscriptshell_QAbstractListModel.cpp: In member function 'virtual QVariant QtScriptShell_QAbstractListModel::data(const QModelIndex&, int) const':
/home/alex/svn-projects/mscore/trunk/mscore/scriptgen/qtbindings/core/qtscriptshell_QAbstractListModel.cpp:119: warning: control reaches end of non-void function
/home/alex/svn-projects/mscore/trunk/mscore/scriptgen/qtbindings/core/qtscriptshell_QAbstractTableModel.cpp: In member function 'virtual int QtScriptShell_QAbstractTableModel::rowCount(const QModelIndex&) const':
/home/alex/svn-projects/mscore/trunk/mscore/scriptgen/qtbindings/core/qtscriptshell_QAbstractTableModel.cpp:386: warning: control reaches end of non-void function
/home/alex/svn-projects/mscore/trunk/mscore/scriptgen/qtbindings/core/qtscriptshell_QAbstractTableModel.cpp: In member function 'virtual QVariant QtScriptShell_QAbstractTableModel::data(const QModelIndex&, int) const':
/home/alex/svn-projects/mscore/trunk/mscore/scriptgen/qtbindings/core/qtscriptshell_QAbstractTableModel.cpp:133: warning: control reaches end of non-void function
/home/alex/svn-projects/mscore/trunk/mscore/scriptgen/qtbindings/core/qtscriptshell_QAbstractTableModel.cpp: In member function 'virtual int QtScriptShell_QAbstractTableModel::columnCount(const QModelIndex&) const':
/home/alex/svn-projects/mscore/trunk/mscore/scriptgen/qtbindings/core/qtscriptshell_QAbstractTableModel.cpp:104: warning: control reaches end of non-void function
[ 17%] Building CXX object scriptgen/qtbindings/core/CMakeFiles/qtscript_core.dir/qtscript_QTextCodecPlugin.cpp.o
[ 17%] Building CXX object scriptgen/qtbindings/core/CMakeFiles/qtscript_core.dir/qtscript_QPersistentModelIndex.cpp.o
[ 17%] Building CXX object scriptgen/qtbindings/core/CMakeFiles/qtscript_core.dir/qtscript_QMimeData.cpp.o
[ 17%] Building CXX object scriptgen/qtbindings/core/CMakeFiles/qtscript_core.dir/qtscript_QModelIndex.cpp.o
Linking CXX shared library libqtscript_core.so
[ 17%] Built target qtscript_core
make: *** [all] Error 2

Alex.

In reply to by werner

Cleaned out, and building 2194, so far i get this:

[ 8%] Built target fluid
[ 8%] Building CXX object mscore/CMakeFiles/smf2xml.dir/midifile.cpp.o
[ 8%] Building CXX object mscore/CMakeFiles/smf2xml.dir/event.cpp.o
Linking CXX static library libqtsingleapp.a
[ 8%] Built target qtsingleapp
In file included from /home/alex/svn-projects/mscore/trunk/mscore/mscore/score.h:33,
from /home/alex/svn-projects/mscore/trunk/mscore/mscore/event.cpp:24:
/home/alex/svn-projects/mscore/trunk/mscore/mscore/select.h:24:23: error: ui_select.h: No such file or directory
[ 8%] Building CXX object mscore/CMakeFiles/smf2xml.dir/drumset.cpp.o
In file included from /home/alex/svn-projects/mscore/trunk/mscore/mscore/score.h:33,
from /home/alex/svn-projects/mscore/trunk/mscore/mscore/event.cpp:24:
/home/alex/svn-projects/mscore/trunk/mscore/mscore/select.h:107: error: 'Ui' has not been declared
/home/alex/svn-projects/mscore/trunk/mscore/mscore/select.h:107: error: expected `{' before 'SelectDialog'
/home/alex/svn-projects/mscore/trunk/mscore/mscore/select.h:107: error: function definition does not declare parameters
[ 8%] Building CXX object mscore/CMakeFiles/smf2xml.dir/xml.cpp.o
make[2]: *** [mscore/CMakeFiles/smf2xml.dir/event.cpp.o] Error 1
make[2]: *** Waiting for unfinished jobs....
[ 8%] Building CXX object mscore/CMakeFiles/xml2smf.dir/xml2smf.cpp.o
[ 8%] Building CXX object scriptgen/qtbindings/core/CMakeFiles/qtscript_core.dir/main.cpp.o
[ 9%] Building CXX object scriptgen/qtbindings/core/CMakeFiles/qtscript_core.dir/qtscript_QBasicTimer.cpp.o
make[1]: *** [mscore/CMakeFiles/smf2xml.dir/all] Error 2
make[1]: *** Waiting for unfinished jobs....
[ 9%] Building CXX object mscore/CMakeFiles/xml2smf.dir/midifile.cpp.o
[ 9%] Building CXX object scriptgen/qtbindings/core/CMakeFiles/qtscript_core.dir/qtscript_QBitArray.cpp.o
[ 9%] Building CXX object scriptgen/qtbindings/core/CMakeFiles/qtscript_core.dir/qtscript_QBuffer.cpp.o
[ 9%] Building CXX object scriptgen/qtbindings/core/CMakeFiles/qtscript_core.dir/qtscript_QByteArray.cpp.o
[ 9%] Building CXX object mscore/CMakeFiles/xml2smf.dir/event.cpp.o
In file included from /home/alex/svn-projects/mscore/trunk/mscore/mscore/score.h:33,
from /home/alex/svn-projects/mscore/trunk/mscore/mscore/event.cpp:24:
/home/alex/svn-projects/mscore/trunk/mscore/mscore/select.h:24:23: error: ui_select.h: No such file or directory
[ 10%] Building CXX object mscore/CMakeFiles/xml2smf.dir/drumset.cpp.o
[ 10%] Building CXX object scriptgen/qtbindings/core/CMakeFiles/qtscript_core.dir/qtscript_QByteArrayMatcher.cpp.o
In file included from /home/alex/svn-projects/mscore/trunk/mscore/mscore/score.h:33,
from /home/alex/svn-projects/mscore/trunk/mscore/mscore/event.cpp:24:
/home/alex/svn-projects/mscore/trunk/mscore/mscore/select.h:107: error: 'Ui' has not been declared
/home/alex/svn-projects/mscore/trunk/mscore/mscore/select.h:107: error: expected `{' before 'SelectDialog'
/home/alex/svn-projects/mscore/trunk/mscore/mscore/select.h:107: error: function definition does not declare parameters
make[2]: *** [mscore/CMakeFiles/xml2smf.dir/event.cpp.o] Error 1
make[2]: *** Waiting for unfinished jobs....
[ 10%] Building CXX object scriptgen/qtbindings/core/CMakeFiles/qtscript_core.dir/qtscript_QChildEvent.cpp.o
[ 10%] Building CXX object scriptgen/qtbindings/core/CMakeFiles/qtscript_core.dir/qtscript_QCoreApplication.cpp.o

[ 18%] Building CXX object scriptgen/qtbindings/core/CMakeFiles/qtscript_core.dir/qtscriptshell_QAbstractItemModel.cpp.o
[ 18%] Building CXX object scriptgen/qtbindings/core/CMakeFiles/qtscript_core.dir/qtscriptshell_QAbstractListModel.cpp.o
[ 18%] Building CXX object scriptgen/qtbindings/core/CMakeFiles/qtscript_core.dir/qtscriptshell_QAbstractTableModel.cpp.o
/home/alex/svn-projects/mscore/trunk/mscore/scriptgen/qtbindings/core/qtscriptshell_QAbstractItemModel.cpp: In member function 'virtual int QtScriptShell_QAbstractItemModel::rowCount(const QModelIndex&) const':
/home/alex/svn-projects/mscore/trunk/mscore/scriptgen/qtbindings/core/qtscriptshell_QAbstractItemModel.cpp:412: warning: control reaches end of non-void function
/home/alex/svn-projects/mscore/trunk/mscore/scriptgen/qtbindings/core/qtscriptshell_QAbstractItemModel.cpp: In member function 'virtual QModelIndex QtScriptShell_QAbstractItemModel::parent(const QModelIndex&) const':
/home/alex/svn-projects/mscore/trunk/mscore/scriptgen/qtbindings/core/qtscriptshell_QAbstractItemModel.cpp:355: warning: control reaches end of non-void function
/home/alex/svn-projects/mscore/trunk/mscore/scriptgen/qtbindings/core/qtscriptshell_QAbstractItemModel.cpp: In member function 'virtual QModelIndex QtScriptShell_QAbstractItemModel::index(int, int, const QModelIndex&) const':
/home/alex/svn-projects/mscore/trunk/mscore/scriptgen/qtbindings/core/qtscriptshell_QAbstractItemModel.cpp:252: warning: control reaches end of non-void function
/home/alex/svn-projects/mscore/trunk/mscore/scriptgen/qtbindings/core/qtscriptshell_QAbstractItemModel.cpp: In member function 'virtual QVariant QtScriptShell_QAbstractItemModel::data(const QModelIndex&, int) const':
/home/alex/svn-projects/mscore/trunk/mscore/scriptgen/qtbindings/core/qtscriptshell_QAbstractItemModel.cpp:131: warning: control reaches end of non-void function
/home/alex/svn-projects/mscore/trunk/mscore/scriptgen/qtbindings/core/qtscriptshell_QAbstractItemModel.cpp: In member function 'virtual int QtScriptShell_QAbstractItemModel::columnCount(const QModelIndex&) const':
/home/alex/svn-projects/mscore/trunk/mscore/scriptgen/qtbindings/core/qtscriptshell_QAbstractItemModel.cpp:102: warning: control reaches end of non-void function
/home/alex/svn-projects/mscore/trunk/mscore/scriptgen/qtbindings/core/qtscriptshell_QAbstractListModel.cpp: In member function 'virtual int QtScriptShell_QAbstractListModel::rowCount(const QModelIndex&) const':
/home/alex/svn-projects/mscore/trunk/mscore/scriptgen/qtbindings/core/qtscriptshell_QAbstractListModel.cpp:372: warning: control reaches end of non-void function
/home/alex/svn-projects/mscore/trunk/mscore/scriptgen/qtbindings/core/qtscriptshell_QAbstractListModel.cpp: In member function 'virtual QVariant QtScriptShell_QAbstractListModel::data(const QModelIndex&, int) const':
/home/alex/svn-projects/mscore/trunk/mscore/scriptgen/qtbindings/core/qtscriptshell_QAbstractListModel.cpp:119: warning: control reaches end of non-void function
/home/alex/svn-projects/mscore/trunk/mscore/scriptgen/qtbindings/core/qtscriptshell_QAbstractTableModel.cpp: In member function 'virtual int QtScriptShell_QAbstractTableModel::rowCount(const QModelIndex&) const':
/home/alex/svn-projects/mscore/trunk/mscore/scriptgen/qtbindings/core/qtscriptshell_QAbstractTableModel.cpp:386: warning: control reaches end of non-void function
/home/alex/svn-projects/mscore/trunk/mscore/scriptgen/qtbindings/core/qtscriptshell_QAbstractTableModel.cpp: In member function 'virtual QVariant QtScriptShell_QAbstractTableModel::data(const QModelIndex&, int) const':
/home/alex/svn-projects/mscore/trunk/mscore/scriptgen/qtbindings/core/qtscriptshell_QAbstractTableModel.cpp:133: warning: control reaches end of non-void function
/home/alex/svn-projects/mscore/trunk/mscore/scriptgen/qtbindings/core/qtscriptshell_QAbstractTableModel.cpp: In member function 'virtual int QtScriptShell_QAbstractTableModel::columnCount(const QModelIndex&) const':
/home/alex/svn-projects/mscore/trunk/mscore/scriptgen/qtbindings/core/qtscriptshell_QAbstractTableModel.cpp:104: warning: control reaches end of non-void function
[ 18%] Building CXX object scriptgen/qtbindings/core/CMakeFiles/qtscript_core.dir/qtscript_QTextCodecPlugin.cpp.o
[ 18%] Building CXX object scriptgen/qtbindings/core/CMakeFiles/qtscript_core.dir/qtscript_QPersistentModelIndex.cpp.o
[ 18%] Building CXX object scriptgen/qtbindings/core/CMakeFiles/qtscript_core.dir/qtscript_QMimeData.cpp.o
[ 18%] Building CXX object scriptgen/qtbindings/core/CMakeFiles/qtscript_core.dir/qtscript_QModelIndex.cpp.o
Linking CXX shared library libqtscript_core.so
[ 18%] Built target qtscript_core
make: *** [all] Error 2
alex@parchmentstudios ~/svn-projects/mscore/trunk/mscore $

Alex.

Do you still have an unanswered question? Please log in first to post your question.